{"text_format":"1","workbook":"xlsx","n_sheets":5,"sheets":["PJ","Données (Carac, Sexe, Tributs)","Données (Défauts, Talents)","Données (Equipements)","Stat"],"not_rendered":{"charts":0,"images":17,"macros":1,"external_links":0,"defined_names":4,"comments":1,"pivot_tables":0},"unopened":[],"bounds":{"document_bytes":16777216,"sheet_cells":100000,"rows_first":2000,"rows_last":500,"rows_between":2000,"halvings":0,"cell_chars":16384,"cell_head_chars":4096},"cells_cut":0,"cells_raw":0,"read":"whole","date_system":"1900"}

{"sheet":"PJ","index":0,"n_rows":105,"n_cols":39,"rows_kept":105,"cut":false,"hidden":false,"merged":[[57,19,57,24],[46,24,46,31],[47,24,47,31],[37,24,37,31],[38,24,38,31],[39,24,39,31],[40,24,40,31],[41,24,41,31],[42,24,42,31],[43,24,43,31],[44,24,44,31],[45,24,45,31],[48,22,48,23],[27,24,27,31],[28,24,28,31],[29,24,29,31],[30,24,30,31],[31,24,31,31],[32,24,32,31],[33,24,33,31],[34,24,34,31],[35,24,35,31],[29,22,29,23],[31,22,31,23],[33,22,33,23],[36,22,36,23],[38,22,38,23],[48,32,48,33],[40,22,40,23],[42,22,42,23],[45,22,45,23],[47,22,47,23],[46,22,46,23],[46,32,46,33],[47,32,47,33],[42,32,42,33],[45,32,45,33],[48,24,48,31],[36,32,36,33],[38,32,38,33],[40,32,40,33],[33,32,33,33],[29,32,29,33],[31,32,31,33],[36,24,36,31],[22,22,22,23],[23,22,23,23],[24,22,24,23],[25,22,25,23],[26,22,26,23],[22,32,22,33],[23,32,23,33],[24,32,24,33],[25,32,25,33],[26,32,26,33],[22,24,22,31],[23,24,23,31],[24,24,24,31],[25,24,25,31],[26,24,26,31],[21,22,21,23],[15,22,15,23],[16,22,16,23],[17,22,17,23],[18,22,18,23],[19,22,19,23],[20,22,20,23],[16,32,16,33],[17,32,17,33],[15,24,15,31],[16,24,16,31],[17,24,17,31],[18,24,18,31],[19,24,19,31],[20,24,20,31],[15,32,15,33],[18,32,18,33],[19,32,19,33],[20,32,20,33],[21,32,21,33],[21,24,21,31],[77,10,77,13],[73,10,74,13],[71,14,71,16],[73,14,74,15],[75,10,76,15],[37,14,38,14],[39,14,40,14],[41,14,42,14],[43,14,45,14],[43,16,45,16],[66,16,66,17],[67,16,67,17],[58,10,58,12],[59,10,59,12],[60,10,60,12],[61,10,61,12],[62,10,62,12],[63,10,63,12],[64,10,64,12],[65,10,65,12],[66,10,66,12],[67,10,67,12],[61,16,61,17],[62,16,62,17],[26,15,27,15],[28,15,29,15],[30,15,31,15],[32,15,33,15],[34,15,36,15],[37,15,38,15],[39,15,40,15],[41,15,42,15],[43,15,45,15],[28,14,29,14],[83,18,85,18],[64,16,64,17],[65,16,65,17],[32,13,33,13],[34,12,36,12],[34,13,36,13],[37,12,38,12],[37,13,38,13],[39,12,40,12],[39,13,40,13],[41,12,42,12],[41,13,42,13],[32,17,33,17],[34,17,36,17],[37,17,38,17],[39,17,40,17],[41,17,42,17],[43,17,45,17],[32,16,33,16],[34,16,36,16],[37,16,38,16],[39,16,40,16],[41,16,42,16],[63,16,63,17],[83,23,85,23],[83,24,85,24],[83,25,85,25],[83,26,85,26],[83,27,85,27],[83,28,85,28],[81,20,81,38],[83,8,83,13],[84,8,84,13],[85,8,85,13],[83,30,85,30],[83,31,85,31],[83,32,85,32],[83,33,85,33],[83,34,85,34],[83,35,85,35],[83,37,85,37],[83,38,85,38],[83,36,84,36],[83,29,85,29],[83,19,85,19],[83,20,85,20],[83,21,85,21],[83,22,85,22],[86,8,86,13],[87,8,87,13],[88,8,88,13],[89,8,89,13],[90,8,90,13],[91,8,91,13],[92,8,92,13],[93,8,93,13],[94,8,94,13],[95,8,95,13],[96,8,96,13],[97,8,97,13],[103,8,103,13],[104,8,104,13],[100,8,100,13],[101,8,101,13],[102,8,102,13],[98,8,98,13],[99,8,99,13],[102,2,102,5],[103,2,103,5],[104,2,104,5],[97,2,97,5],[98,2,98,5],[99,2,99,5],[100,2,100,5],[101,2,101,5],[105,2,105,15],[94,2,94,5],[95,2,95,5],[96,2,96,5],[92,2,92,5],[93,2,93,5],[90,2,90,5],[91,2,91,5],[88,2,88,5],[89,2,89,5],[86,2,86,5],[87,2,87,5],[84,2,84,5],[85,2,85,5],[81,2,81,4],[83,2,83,5],[76,2,76,5],[77,2,77,5],[78,2,78,5],[71,2,71,5],[72,2,72,5],[73,2,73,5],[74,2,74,5],[75,2,75,5],[68,2,68,5],[68,10,68,12],[68,16,68,17],[69,2,69,5],[70,2,70,5],[71,10,71,13],[65,2,65,5],[66,2,66,5],[67,2,67,5],[57,2,57,5],[57,10,57,12],[58,2,58,5],[59,2,59,5],[60,2,60,5],[61,2,61,5],[62,2,62,5],[63,2,63,5],[64,2,64,5],[55,2,55,4],[21,2,26,2],[36,2,36,9],[26,3,26,5],[21,6,21,8],[22,6,22,8],[23,6,23,8],[24,6,24,8],[52,2,52,5],[47,2,47,5],[48,2,48,5],[49,2,49,5],[50,2,50,5],[51,2,51,5],[45,2,45,3],[46,7,46,9],[46,2,46,6],[12,13,12,15],[15,13,15,14],[17,13,17,14],[26,14,27,14],[57,16,57,17],[58,16,58,17],[59,16,59,17],[60,16,60,17],[55,6,55,18],[23,13,23,14],[26,13,27,13],[28,13,29,13],[30,13,31,13],[43,12,45,12],[43,13,45,13],[26,17,27,17],[28,17,29,17],[30,17,31,17],[26,16,27,16],[28,16,29,16],[30,16,31,16],[30,14,31,14],[32,14,33,14],[34,14,36,14],[26,12,27,12],[28,12,29,12],[30,12,31,12],[32,12,33,12],[12,6,12,9],[29,2,29,5],[25,6,25,8],[26,6,26,8],[15,3,15,7],[16,7,16,9],[17,2,17,3],[18,2,20,9],[21,3,21,5],[22,3,22,5],[23,3,23,5],[24,3,24,5],[25,3,25,5],[12,3,12,4]]}
[0]
[]
[null,null,null,null,null,null,null,null,null,null,null,null,null,null,null,null,null,null,null,"Fichier créé par ©Booguii 2019"]
[null,null,"A compléter avant validation",null,null,null,null,null,null,null,null,null,null,null,null,null,null,null,null,"Tous droits réservés"]
[null,null,{"$f":"IF(G30=0,1,-1)","v":-1},"Points de Caractéristiques Primaires",null,null,{"$f":"_xlfn.IFNA(IF(G82=0,1,-1),-1)","v":-1},"Ce qui est à toi est à moi",null,null,null,null,null,null,null,null,null,null,null,"Contact : bouguifou@yahoo.fr"]
[null,null,{"$f":"IF(AND(E46=0,C47>=0,H47>=0),1,-1)","v":-1},"Points de Talents",null,null,{"$f":"IF(ISBLANK(S87),-1,1)","v":-1},"Vêtements et armures"]
[null,null,{"$f":"_xlfn.IFNA(IF(G56=0,1,-1),-1)","v":-1},"Matos à Viander"]
[]
[]
[]
{"$rows_left_out":96}
{"sheet":"Données (Carac, Sexe, Tributs)","index":1,"n_rows":39,"n_cols":77,"rows_kept":39,"cut":false,"hidden":true,"merged":[[1,22,1,27],[1,28,1,29]]}
[]
[null,null,"Agilité","Beauté","Endurance","Force","Intelligence","Perception","Precision","Rapidité","Acrobatie","Combat","Conduite","Discrétion","Lancer","Marchandage","Mécanique","Premiers Soins","Repérage","Résistance","Séduction","Tir","Matériel (Matos à viander)",null,null,null,null,null,"Matériel (Ce qui est à moi est à moi)",null,"Vêtements","Agriculture et élevage","Amitié","Camouflage","Célébrité","Chance","Combat motorisé","Combat nocturne","Combat rural","Combat sans armes","Combat urbain","Comédie","Commandement","Conduite spécialisée","Conduite sportive","Construction","Convaincre","Course","Cuisine","Dessin","Déguisement","Démolition","Dressage d'animaux","Escalade","Esquive","Flatterie","Forgeron","Héraldique","Histoire","Lire et écrire","Maître d'arme","Manipulation","Manufacture d'armes","Manufacture de vêtements","Maquillage","Musicien","Nage","Parade","Pêche","Pistage","Pose de pièges","Résistance à l'alcool","Richesse","Spécialisation en arme","Tir indirect","Tir rapide","Tricherie"]
[1,"CaracPrim",1,1,1,1,1,1,1,1]
[null,"Sexe"]
[{"$f":"_xlfn.IFNA(MATCH(B5,PJ!$F$17,0),0)","v":0},"M",-1,null,null,1]
[{"$f":"_xlfn.IFNA(MATCH(B6,PJ!$F$17,0),0)","v":0},"F",1,null,null,-1]
[null,"Tributs"]
[{"$f":"_xlfn.IFNA(MATCH(B8,PJ!$D$16,0),0)","v":0},"Amazones",null,1,null,null,null,null,null,1,null,null,null,10,null,-20,null,null,null,null,null,20,"1 arme à distance de moins de $ 10 000 et 2 armes de moins de $ 1 000 chacune","2 armes de moins de $ 1 000 chacune","1 armes de moin de $ 1 000",null,null,null,5,500,"Maximum 15 espaces au total, toutes les matières"]
[{"$f":"_xlfn.IFNA(MATCH(B9,PJ!$D$16,0),0)","v":0},"Conf. Serpent",null,null,null,null,null,1,1,null,null,null,-50,20,null,null,null,null,null,null,null,10,"2 armes de moins de $ 10 000 chacune et 2 armes de moins de $ 1 000 chacune","1 arme de moins de $ 10 000 et 2 armes de moins de $ 1 000 chacune","2 armes de moins de $ 1 000 chacune","1 arme de moins de $ 1 000",null,null,4,1000,"Pas de cuir, pas d'acier, maximum 3 espaces de cuir clouté, autres matières sans restriction"]
[{"$f":"_xlfn.IFNA(MATCH(B10,PJ!$D$16,0),0)","v":0},"Enfants",1,null,null,null,null,null,null,1,20,null,null,20,null,-20,null,null,10,null,null,null,"1 arme de tir de moins de $ 10 000 et 3 armes de moins de $ 400 chacune","3 armes de moins de $ 400 chacune","2 armes de moins de $ 400 chacune","1 arme de moins de $ 400",null,null,5,200,"Toutes les matières sans restrition"]
{"$rows_left_out":30}
{"sheet":"Données (Défauts, Talents)","index":2,"n_rows":139,"n_cols":61,"rows_kept":139,"cut":false,"hidden":true,"merged":[]}
[null,null,null,null,null,null,null,null,null,null,null,null,null,null,null,null,null,null,null,null,null,null,null,{"$f":"SUMIF(A3:A150,\"<>0\",X3:X150)","v":0}]
[null,"Défauts","PPe ","Amazones","Conf. Serpent","Enfants","Conservateurs","Fils du métal","Fermiers","Guerisseurs","Garagistes","Skinheads","Punks","Yankees","Vikings","Indiens","Hell's Angels","Mercenaires","Marchands","Justiciers","Affichage","PPe ajustés","PP","PP ajustés","Explication","Acrobatie","Combat","Conduite","Discrétion","Lancer","Marchandage","Mécanique","Premiers Soins","Repérage","Résistance","Séduction","Tir","Agilité","Beauté","Endurance","Force","Intelligence","Perception","Precision","Rapidité","Acrobatie","Combat","Conduite","Discrétion","Lancer","Marchandage","Mécanique","Premiers Soins","Repérage","Résistance","Séduction","Tir","Talents spéciaux"]
[{"$f":"_xlfn.IFNA(MATCH(U3,PJ!$D$22:$D$27,0),0)","v":0},"Alcoolique",20,null,null,null,"/2",null,"+5",null,"/2",null,"+5","+5",null,null,"+5","/2","+5",null,{"$f":"B3&\" (\"&C3&HLOOKUP(PJ!$D$16,'Données (Défauts, Talents)'!$D$2:$T$79,ROW(B3)-1,FALSE)&\")\"&IF(X3<>0,\" PP\" &X3,\"\")","v":{"$error":"#N/A"}},{"$f":"IF(HLOOKUP(PJ!$D$16,'Données (Défauts, Talents)'!$D$2:$T$79,ROW($B3)-1,FALSE)=\"/2\",ROUNDUP($C3/2,0),$C3+HLOOKUP(PJ!$D$16,'Données (Défauts, Talents)'!$D$2:$T$79,ROW($B3)-1,FALSE))","v":{"$error":"#N/A"}},-5,{"$f":"IF(HLOOKUP(PJ!$D$16,'Données (Défauts, Talents)'!$D$2:$T$79,ROW($B3)-1,FALSE)=\"/2\",$W3*2,IF(HLOOKUP(PJ!$D$16,'Données (Défauts, Talents)'!$D$2:$T$79,ROW($B3)-1,FALSE)=\"+5\",0,$W3))","v":{"$error":"#N/A"}},"Le personnage ne peut résister à la vue de l'alcool et doit en absorber le plus  possible. Les effets sont laissés à la discretion du maitre de jeu."]
[{"$f":"_xlfn.IFNA(MATCH(U4,PJ!$D$22:$D$27,0),0)","v":0},"Avare",15,null,null,null,"+5",null,null,"/2","+5",null,null,"+5",null,null,null,"+5","+5",null,{"$f":"B4&\" (\"&C4&HLOOKUP(PJ!$D$16,'Données (Défauts, Talents)'!$D$2:$T$79,ROW(B4)-1,FALSE)&\")\"&IF(X4<>0,\" PP\" &X4,\"\")","v":{"$error":"#N/A"}},{"$f":"IF(HLOOKUP(PJ!$D$16,'Données (Défauts, Talents)'!$D$2:$T$79,ROW($B4)-1,FALSE)=\"/2\",ROUNDUP($C4/2,0),$C4+HLOOKUP(PJ!$D$16,'Données (Défauts, Talents)'!$D$2:$T$79,ROW($B4)-1,FALSE))","v":{"$error":"#N/A"}},-15,{"$f":"IF(HLOOKUP(PJ!$D$16,'Données (Défauts, Talents)'!$D$2:$T$79,ROW($B4)-1,FALSE)=\"/2\",$W4*2,IF(HLOOKUP(PJ!$D$16,'Données (Défauts, Talents)'!$D$2:$T$79,ROW($B4)-1,FALSE)=\"+5\",0,$W4))","v":{"$error":"#N/A"}},"Le personnage refuse absolument de donner ou de prêter ce qui lui appartient,  même a un autre membre de sa tribu. ll subit un malus de 20% au  marchandage. ll refusera le plus possible de prêter son équipement.",null,null,null,null,null,-20]
[{"$f":"_xlfn.IFNA(MATCH(U5,PJ!$D$22:$D$27,0),0)","v":0},"Aversion envers les animaux",15,null,null,null,null,null,"/2",null,null,null,null,"+5",null,null,null,null,null,null,{"$f":"B5&\" (\"&C5&HLOOKUP(PJ!$D$16,'Données (Défauts, Talents)'!$D$2:$T$79,ROW(B5)-1,FALSE)&\")\"&IF(X5<>0,\" PP\" &X5,\"\")","v":{"$error":"#N/A"}},{"$f":"IF(HLOOKUP(PJ!$D$16,'Données (Défauts, Talents)'!$D$2:$T$79,ROW($B5)-1,FALSE)=\"/2\",ROUNDUP($C5/2,0),$C5+HLOOKUP(PJ!$D$16,'Données (Défauts, Talents)'!$D$2:$T$79,ROW($B5)-1,FALSE))","v":{"$error":"#N/A"}},null,{"$f":"IF(HLOOKUP(PJ!$D$16,'Données (Défauts, Talents)'!$D$2:$T$79,ROW($B5)-1,FALSE)=\"/2\",$W5*2,IF(HLOOKUP(PJ!$D$16,'Données (Défauts, Talents)'!$D$2:$T$79,ROW($B5)-1,FALSE)=\"+5\",0,$W5))","v":{"$error":"#N/A"}},"Le personnage a horreur des animaux et ceux-ci le lui rendent bien... ll ne peut  posseder le talent “dressage d'animaux\", subit un malus de 50% à leur reaction  et ceux-ci reçoivent un bonus de 10% pour le toucher."]
[{"$f":"_xlfn.IFNA(MATCH(U6,PJ!$D$22:$D$27,0),0)","v":0},"Borgne",10,null,null,null,null,null,null,null,null,null,null,"+5",null,null,null,null,null,null,{"$f":"B6&\" (\"&C6&HLOOKUP(PJ!$D$16,'Données (Défauts, Talents)'!$D$2:$T$79,ROW(B6)-1,FALSE)&\")\"&IF(X6<>0,\" PP\" &X6,\"\")","v":{"$error":"#N/A"}},{"$f":"IF(HLOOKUP(PJ!$D$16,'Données (Défauts, Talents)'!$D$2:$T$79,ROW($B6)-1,FALSE)=\"/2\",ROUNDUP($C6/2,0),$C6+HLOOKUP(PJ!$D$16,'Données (Défauts, Talents)'!$D$2:$T$79,ROW($B6)-1,FALSE))","v":{"$error":"#N/A"}},null,{"$f":"IF(HLOOKUP(PJ!$D$16,'Données (Défauts, Talents)'!$D$2:$T$79,ROW($B6)-1,FALSE)=\"/2\",$W6*2,IF(HLOOKUP(PJ!$D$16,'Données (Défauts, Talents)'!$D$2:$T$79,ROW($B6)-1,FALSE)=\"+5\",0,$W6))","v":{"$error":"#N/A"}},"Le personnage a eu un oeil crevé dans un combat ou un accident. Les effets d'un tel handicap sont les suivants : Séduction -30% et Repérage -20%",null,null,null,null,null,null,null,null,-20,null,-30]
[{"$f":"_xlfn.IFNA(MATCH(U7,PJ!$D$22:$D$27,0),0)","v":0},"Boulimique",10,null,null,null,null,null,null,null,null,null,null,"+5",null,"/2",null,"/2",null,null,{"$f":"B7&\" (\"&C7&HLOOKUP(PJ!$D$16,'Données (Défauts, Talents)'!$D$2:$T$79,ROW(B7)-1,FALSE)&\")\"&IF(X7<>0,\" PP\" &X7,\"\")","v":{"$error":"#N/A"}},{"$f":"IF(HLOOKUP(PJ!$D$16,'Données (Défauts, Talents)'!$D$2:$T$79,ROW($B7)-1,FALSE)=\"/2\",ROUNDUP($C7/2,0),$C7+HLOOKUP(PJ!$D$16,'Données (Défauts, Talents)'!$D$2:$T$79,ROW($B7)-1,FALSE))","v":{"$error":"#N/A"}},null,{"$f":"IF(HLOOKUP(PJ!$D$16,'Données (Défauts, Talents)'!$D$2:$T$79,ROW($B7)-1,FALSE)=\"/2\",$W7*2,IF(HLOOKUP(PJ!$D$16,'Données (Défauts, Talents)'!$D$2:$T$79,ROW($B7)-1,FALSE)=\"+5\",0,$W7))","v":{"$error":"#N/A"}},"Le personnage doit manger sa ration de nourriture toutes les 3 heures (au lieu  de toutes les 24 heures). Les effets sont laissés à la discrétion du maitre de jeu."]
[{"$f":"_xlfn.IFNA(MATCH(U8,PJ!$D$22:$D$27,0),0)","v":0},"Bras en moins",40,null,null,null,null,null,null,null,"/2",null,null,"+5",null,null,null,null,null,null,{"$f":"B8&\" (\"&C8&HLOOKUP(PJ!$D$16,'Données (Défauts, Talents)'!$D$2:$T$79,ROW(B8)-1,FALSE)&\")\"&IF(X8<>0,\" PP\" &X8,\"\")","v":{"$error":"#N/A"}},{"$f":"IF(HLOOKUP(PJ!$D$16,'Données (Défauts, Talents)'!$D$2:$T$79,ROW($B8)-1,FALSE)=\"/2\",ROUNDUP($C8/2,0),$C8+HLOOKUP(PJ!$D$16,'Données (Défauts, Talents)'!$D$2:$T$79,ROW($B8)-1,FALSE))","v":{"$error":"#N/A"}},null,{"$f":"IF(HLOOKUP(PJ!$D$16,'Données (Défauts, Talents)'!$D$2:$T$79,ROW($B8)-1,FALSE)=\"/2\",$W8*2,IF(HLOOKUP(PJ!$D$16,'Données (Défauts, Talents)'!$D$2:$T$79,ROW($B8)-1,FALSE)=\"+5\",0,$W8))","v":{"$error":"#N/A"}},"Le personnage a le bras coupé au niveau du coude. Les effets d'un tel handicap sont les suivants : Conduite -40%, Séduction -30%, Mécanique -50% et Premiers soins -30%",null,null,-40,null,null,null,-50,-30,null,null,-30]
[{"$f":"_xlfn.IFNA(MATCH(U9,PJ!$D$22:$D$27,0),0)","v":0},"Cicatrice",5,"/2","/2",null,null,"+5",null,null,null,null,"+5","+5","+5","+5",null,"+5",null,null,{"$f":"B9&\" (\"&C9&HLOOKUP(PJ!$D$16,'Données (Défauts, Talents)'!$D$2:$T$79,ROW(B9)-1,FALSE)&\")\"&IF(X9<>0,\" PP\" &X9,\"\")","v":{"$error":"#N/A"}},{"$f":"IF(HLOOKUP(PJ!$D$16,'Données (Défauts, Talents)'!$D$2:$T$79,ROW($B9)-1,FALSE)=\"/2\",ROUNDUP($C9/2,0),$C9+HLOOKUP(PJ!$D$16,'Données (Défauts, Talents)'!$D$2:$T$79,ROW($B9)-1,FALSE))","v":{"$error":"#N/A"}},null,{"$f":"IF(HLOOKUP(PJ!$D$16,'Données (Défauts, Talents)'!$D$2:$T$79,ROW($B9)-1,FALSE)=\"/2\",$W9*2,IF(HLOOKUP(PJ!$D$16,'Données (Défauts, Talents)'!$D$2:$T$79,ROW($B9)-1,FALSE)=\"+5\",0,$W9))","v":{"$error":"#N/A"}},"Le personnage a la figure largement barrée par une cicatrice. Les effets d'un tel handicap sont les suivants : Séduction -20%",null,null,null,null,null,null,null,null,null,null,-20]
[{"$f":"_xlfn.IFNA(MATCH(U10,PJ!$D$22:$D$27,0),0)","v":0},"Code d'honneur",null,null,null,null,"+5","/2",null,"+5",null,null,null,"+5","+5","+5","+5","+5",null,"+5",{"$f":"B10&\" (\"&C10&HLOOKUP(PJ!$D$16,'Données (Défauts, Talents)'!$D$2:$T$79,ROW(B10)-1,FALSE)&\")\"&IF(X10<>0,\" PP\" &X10,\"\")","v":{"$error":"#N/A"}},{"$f":"IF(HLOOKUP(PJ!$D$16,'Données (Défauts, Talents)'!$D$2:$T$79,ROW($B10)-1,FALSE)=\"/2\",ROUNDUP($C10/2,0),$C10+HLOOKUP(PJ!$D$16,'Données (Défauts, Talents)'!$D$2:$T$79,ROW($B10)-1,FALSE))","v":{"$error":"#N/A"}},null,{"$f":"IF(HLOOKUP(PJ!$D$16,'Données (Défauts, Talents)'!$D$2:$T$79,ROW($B10)-1,FALSE)=\"/2\",$W10*2,IF(HLOOKUP(PJ!$D$16,'Données (Défauts, Talents)'!$D$2:$T$79,ROW($B10)-1,FALSE)=\"+5\",0,$W10))","v":{"$error":"#N/A"}},"Le personnage suit une ligne de conduite qui lui est propre (exemple : ne jamais combattre (40), ne jamais frapper un adversaire à terre (15)). Il revient au  joueur d`inventer alors un code d`honneur pour son personnage et au MJ d'évaluer le nombre de points que cela lui rapporte."]
{"$rows_left_out":130}
{"sheet":"Données (Equipements)","index":3,"n_rows":153,"n_cols":36,"rows_kept":153,"cut":false,"hidden":true,"merged":[]}
[]
[{"$f":"SUBTOTAL(3,PJ!C59:C68)","v":0},"Armes de jet","Affichage",null,"Amazones","Conf. Serpent","Enfants","Conservateurs","Fils du métal","Fermiers","Guerisseurs","Garagistes","Skinheads","Punks","Yankees","Vikings","Indiens","Hell's Angels","Mercenaires","Marchands","Justiciers","Précision","Dommage","Portée / Rayon","CDF","Poids","Prix","Mains / Hommes","Magasin","Pose","Transport","Qtt / Type de munitions","Explication","Utilisation","Jet min","Jet max"]
[{"$f":"IF(ISERROR(SEARCH($A$2+1,HLOOKUP(PJ!$D$16,$E$2:$U$88,ROW($B3)-1,FALSE))),A2,A2+1)","v":0},"Boomerang",{"$f":"B3&\" (\"&TEXT(AA3,\"$ # ##0\")&\")\"","v":"Boomerang ($ 450)"},{"$f":"_xlfn.IFNA(VLOOKUP(ROW(A3)+$A$2-2,A3:C88,3,FALSE),)","v":0},23,1234,null,null,245,3,null,12,1234,1,12,3,23,23,123456,null,3,"-10","D6+2","25/50","1",900,450,"1",null,null,null,"2",null,2,3,8]
[{"$f":"IF(ISERROR(SEARCH($A$2+1,HLOOKUP(PJ!$D$16,$E$2:$U$88,ROW($B4)-1,FALSE))),A3,A3+1)","v":0},"Cocktail Molotov","Cocktail Molotov ($ 300)",0,23,1234,234,null,245,3,null,12,1234,123456,12,3,23,23,123456,null,3,"+5","D6+2","07/15","1",400,300,"2",null,null,null,"4",null,2,3,8]
[{"$f":"IF(ISERROR(SEARCH($A$2+1,HLOOKUP(PJ!$D$16,$E$2:$U$88,ROW($B5)-1,FALSE))),A4,A4+1)","v":0},"Cran d'arrêt","Cran d'arrêt ($ 280)",0,23,1234,234,null,245,3,null,12,1234,123456,12,3,23,23,123456,null,3,"+5","D6-1","05/10","2",250,280,"1",null,null,null,"4",null,4,0,5]
[{"$f":"IF(ISERROR(SEARCH($A$2+1,HLOOKUP(PJ!$D$16,$E$2:$U$88,ROW($B6)-1,FALSE))),A5,A5+1)","v":0},"Epieu","Epieu ($ 400)",0,23,1234,234,null,245,3,1,12,1234,123456,12,3,23,23,123456,null,3,"0","D6+2","04/08","1",3500,400,"1",null,null,null,"4",null,4,3,8]
[{"$f":"IF(ISERROR(SEARCH($A$2+1,HLOOKUP(PJ!$D$16,$E$2:$U$88,ROW($B7)-1,FALSE))),A6,A6+1)","v":0},"Filet","Filet ($ 500)",0,23,1234,null,null,245,3,null,12,1234,1,12,3,23,23,123456,null,3,"+10",null,"01/02","1/3",1000,500,"2",null,null,null,"1",null,2]
[{"$f":"IF(ISERROR(SEARCH($A$2+1,HLOOKUP(PJ!$D$16,$E$2:$U$88,ROW($B8)-1,FALSE))),A7,A7+1)","v":0},"Fléchette","Fléchette ($ 100)",0,23,1234,234,null,245,3,1,12,1234,123456,12,3,23,23,123456,null,3,"+10","D6-2","03/06","3",50,100,"1",null,null,null,"4",null,2,0,4]
[{"$f":"IF(ISERROR(SEARCH($A$2+1,HLOOKUP(PJ!$D$16,$E$2:$U$88,ROW($B9)-1,FALSE))),A8,A8+1)","v":0},"Grappin","Grappin ($ 700)",0,23,1234,null,null,245,null,null,12,1234,1,12,3,23,23,123456,null,3,"-10","D6+2","05/10","1/2",3000,700,"2",null,null,null,"1",null,2,3,8]
[{"$f":"IF(ISERROR(SEARCH($A$2+1,HLOOKUP(PJ!$D$16,$E$2:$U$88,ROW($B10)-1,FALSE))),A9,A9+1)","v":0},"Grenade Défensive","Grenade Défensive ($ 600)",0,23,1234,null,null,245,null,null,12,1234,1,12,3,23,23,123456,null,3,"+10","6D6E10","20/30","1",500,600,"1",null,null,null,"1",null,2,6,36]
{"$rows_left_out":144}
{"sheet":"Stat","index":4,"n_rows":2,"n_cols":27,"rows_kept":2,"cut":false,"hidden":false,"merged":[]}
["Date et heure","Caractéristique Ou Talents","Valeur de base","Valeur corrigée","Jet","RC","EC","Agilité","Beauté","Endurance","Force","Intelligence","Perception","Precision","Rapidité","Acrobatie","Combat","Conduite","Discrétion","Lancer","Marchandage","Mécanique","Premiers Soins","Repérage","Résistance","Séduction","Tir"]
["Date et heure",null,null,null,null,{"$f":"IF(AND(E2<=D2/10,D2<>\"\",E2<>\"\"),1,\"\")","v":""},{"$f":"IF(AND(E2>=90+D2/10,D2<>\"\",E2<>\"\"),1,\"\")","v":""},{"$f":"PJ!C32","v":1},{"$f":"PJ!E32","v":1},{"$f":"PJ!G32","v":1},{"$f":"PJ!I32","v":1},{"$f":"PJ!C34","v":1},{"$f":"PJ!E34","v":1},{"$f":"PJ!G34","v":1},{"$f":"PJ!I34","v":1},{"$f":"PJ!C39","v":10},{"$f":"PJ!E39","v":10},{"$f":"PJ!G39","v":10},{"$f":"PJ!I39","v":10},{"$f":"PJ!C41","v":10},{"$f":"PJ!E41","v":10},{"$f":"PJ!G41","v":10},{"$f":"PJ!I41","v":10},{"$f":"PJ!C43","v":10},{"$f":"PJ!E43","v":10},{"$f":"PJ!G43","v":10},{"$f":"PJ!I43","v":10}]